fork download
  1. ==> Making package: libdigidocpp 3.13.6.1371-1 (Mon 18 Jun 2018 06:42:20 PM UTC)
  2. ==> Checking runtime dependencies...
  3. ==> Checking buildtime dependencies...
  4. ==> Retrieving sources...
  5. -> Found libdigidocpp_3.13.6.1371.orig.tar.xz
  6. ==> Validating source files with sha256sums...
  7. libdigidocpp_3.13.6.1371.orig.tar.xz ... Passed
  8. ==> Extracting sources...
  9. -> Extracting libdigidocpp_3.13.6.1371.orig.tar.xz with bsdtar
  10. ==> Starting prepare()...
  11. ==> Removing existing $pkgdir/ directory...
  12. ==> Starting build()...
  13. -- The C compiler identification is GNU 8.1.1
  14. -- The CXX compiler identification is GNU 8.1.1
  15. -- Check for working C compiler: /usr/bin/cc
  16. -- Check for working C compiler: /usr/bin/cc -- works
  17. -- Detecting C compiler ABI info
  18. -- Detecting C compiler ABI info - done
  19. -- Detecting C compile features
  20. -- Detecting C compile features - done
  21. -- Check for working CXX compiler: /usr/bin/c++
  22. -- Check for working CXX compiler: /usr/bin/c++ -- works
  23. -- Detecting CXX compiler ABI info
  24. -- Detecting CXX compiler ABI info - done
  25. -- Detecting CXX compile features
  26. -- Detecting CXX compile features - done
  27. -- Found Doxygen: /usr/bin/doxygen (found version "1.8.14") found components: doxygen missing components: dot
  28. -- Could NOT find LibDigiDoc (missing: LIBDIGIDOC_INCLUDE_DIR)
  29. -- Found OpenSSL: /usr/lib/libcrypto.so (found suitable version "1.1.0h", minimum required is "1.0.1")
  30. -- Found PKCS11_Module: opensc-pkcs11.so
  31. -- Found PODOFO: /usr/lib/libpodofo.so
  32. -- Looking for pthread.h
  33. -- Looking for pthread.h - found
  34. -- Looking for pthread_create
  35. -- Looking for pthread_create - not found
  36. -- Looking for pthread_create in pthreads
  37. -- Looking for pthread_create in pthreads - not found
  38. -- Looking for pthread_create in pthread
  39. -- Looking for pthread_create in pthread - found
  40. -- Found Threads: TRUE
  41. -- Found XercesC: /usr/lib/libxerces-c.so
  42. -- Found XmlSecurityC: /usr/lib/libxml-security-c.so
  43. -- Found XSD: /usr/bin/xsdcxx (found suitable version "4.0.0", minimum required is "4.0")
  44. -- Found ZLIB: /usr/lib/libz.so (found version "1.2.11")
  45. -- Could NOT find SWIG (missing: SWIG_EXECUTABLE SWIG_DIR)
  46. -- Found JNI: /usr/lib/jvm/default/jre/lib/amd64/libjawt.so
  47. -- MiniZip not found; using bundled copy.
  48. CMake Warning at /usr/share/cmake-3.11/Modules/FindBoost.cmake:587 (message):
  49. Imported targets and dependency information not available for Boost version
  50. (all versions older than 1.33)
  51. Call Stack (most recent call first):
  52. /usr/share/cmake-3.11/Modules/FindBoost.cmake:950 (_Boost_COMPONENT_DEPENDENCIES)
  53. /usr/share/cmake-3.11/Modules/FindBoost.cmake:1618 (_Boost_MISSING_DEPENDENCIES)
  54. test/CMakeLists.txt:1 (find_package)
  55.  
  56.  
  57. -- Could NOT find Boost
  58. -- Configuring done
  59. -- Generating done
  60. -- Build files have been written to: /makepkg/libdigidocpp/src/libdigidocpp-build
  61. [ 2%] Generating xml/conf.cxx, xml/conf.hxx
  62. [ 2%] Generating xml/ts_119612v020101_sie_xsd.cxx, xml/ts_119612v020101_sie_xsd.hxx
  63. [ 3%] Generating xml/OpenDocument_manifest.cxx, xml/OpenDocument_manifest.hxx
  64. Scanning dependencies of target docs
  65. [ 4%] Generating xml/xmldsig-core-schema.cxx, xml/xmldsig-core-schema.hxx
  66. Scanning dependencies of target minizip
  67. [ 5%] Generating API documentation with Doxygen
  68. [ 7%] Building C object src/CMakeFiles/minizip.dir/minizip/zip.c.o
  69. warning: Tag `CLANG_ASSISTED_PARSING' at line 1073 of file `/makepkg/libdigidocpp/src/libdigidocpp-build/Doxyfile' belongs to an option that was not enabled at compile time.
  70. To avoid this warning please remove this line from your configuration file or upgrade it using "doxygen -u", or recompile doxygen with this feature enabled.
  71. warning: Tag `CLANG_OPTIONS' at line 1081 of file `/makepkg/libdigidocpp/src/libdigidocpp-build/Doxyfile' belongs to an option that was not enabled at compile time.
  72. To avoid this warning please remove this line from your configuration file or upgrade it using "doxygen -u", or recompile doxygen with this feature enabled.
  73. Notice: Output directory `/makepkg/libdigidocpp/src/libdigidocpp-build/doc/' does not exist. I have created it for you.
  74. Searching for include files...
  75. Searching for example files...
  76. Searching for files in directory /makepkg/libdigidocpp/src
  77. Searching for files in directory /makepkg/libdigidocpp/src/cmake
  78. Searching for files in directory /makepkg/libdigidocpp/src/cmake/modules
  79. Searching for files in directory /makepkg/libdigidocpp/src/debian
  80. Searching for files in directory /makepkg/libdigidocpp/src/debian/source
  81. Searching for files in directory /makepkg/libdigidocpp/src/doc
  82. Searching for files in directory /makepkg/libdigidocpp/src/doc/images
  83. Searching for files in directory /makepkg/libdigidocpp/src/etc
  84. Searching for files in directory /makepkg/libdigidocpp/src/etc/schema
  85. Searching for files in directory /makepkg/libdigidocpp/src/examples
  86. Searching for files in directory /makepkg/libdigidocpp/src/examples/DigiDocCSharp
  87. Searching for files in directory /makepkg/libdigidocpp/src/examples/DigiDocCSharp/Properties
  88. Searching for files in directory /makepkg/libdigidocpp/src/examples/libdigidocpp-android
  89. Searching for files in directory /makepkg/libdigidocpp/src/examples/libdigidocpp-android/app
  90. Searching for files in directory /makepkg/libdigidocpp/src/examples/libdigidocpp-android/app/src
  91. Searching for files in directory /makepkg/libdigidocpp/src/examples/libdigidocpp-android/app/src/main
  92. Searching for files in directory /makepkg/libdigidocpp/src/examples/libdigidocpp-android/app/src/main/java
  93. Searching for files in directory /makepkg/libdigidocpp/src/examples/libdigidocpp-android/app/src/main/java/ee
  94. Searching for files in directory /makepkg/libdigidocpp/src/examples/libdigidocpp-android/app/src/main/java/ee/ria
  95. Searching for files in directory /makepkg/libdigidocpp/src/examples/libdigidocpp-android/app/src/main/java/ee/ria/libdigidocpp
  96. Searching for files in directory /makepkg/libdigidocpp/src/examples/libdigidocpp-android/app/src/main/res
  97. Searching for files in directory /makepkg/libdigidocpp/src/examples/libdigidocpp-android/app/src/main/res/drawable-hdpi
  98. Searching for files in directory /makepkg/libdigidocpp/src/examples/libdigidocpp-android/app/src/main/res/drawable-mdpi
  99. Searching for files in directory /makepkg/libdigidocpp/src/examples/libdigidocpp-android/app/src/main/res/drawable-xhdpi
  100. Searching for files in directory /makepkg/libdigidocpp/src/examples/libdigidocpp-android/app/src/main/res/drawable-xxhdpi
  101. Searching for files in directory /makepkg/libdigidocpp/src/examples/libdigidocpp-android/app/src/main/res/layout
  102. Searching for files in directory /makepkg/libdigidocpp/src/examples/libdigidocpp-android/app/src/main/res/menu
  103. Searching for files in directory /makepkg/libdigidocpp/src/examples/libdigidocpp-android/app/src/main/res/raw
  104. Searching for files in directory /makepkg/libdigidocpp/src/examples/libdigidocpp-android/app/src/main/res/values
  105. Searching for files in directory /makepkg/libdigidocpp/src/examples/libdigidocpp-android/app/src/main/res/values-v11
  106. Searching for files in directory /makepkg/libdigidocpp/src/examples/libdigidocpp-android/app/src/main/res/values-v14
  107. Searching for files in directory /makepkg/libdigidocpp/src/examples/libdigidocpp-android/app/src/main/res/values-w820dp
  108. Searching for files in directory /makepkg/libdigidocpp/src/examples/libdigidocpp-android/gradle
  109. Searching for files in directory /makepkg/libdigidocpp/src/examples/libdigidocpp-android/gradle/wrapper
  110. Searching for files in directory /makepkg/libdigidocpp/src/examples/libdigidocpp-ios
  111. Searching for files in directory /makepkg/libdigidocpp/src/examples/libdigidocpp-ios/libdigidocpp-ios
  112. Searching for files in directory /makepkg/libdigidocpp/src/examples/libdigidocpp-ios/libdigidocpp-ios/Base.lproj
  113. Searching for files in directory /makepkg/libdigidocpp/src/examples/libdigidocpp-ios/libdigidocpp-ios/Images.xcassets
  114. Searching for files in directory /makepkg/libdigidocpp/src/examples/libdigidocpp-ios/libdigidocpp-ios/Images.xcassets/AppIcon.appiconset
  115. Searching for files in directory /makepkg/libdigidocpp/src/examples/libdigidocpp-ios/libdigidocpp-ios.xcodeproj
  116. Searching for files in directory /makepkg/libdigidocpp/src/examples/libdigidocpp-ios/libdigidocpp-ios.xcodeproj/project.xcworkspace
  117. Searching for files in directory /makepkg/libdigidocpp/src/libdigidocpp-build
  118. Searching for files in directory /makepkg/libdigidocpp/src/libdigidocpp-build/CMakeFiles
  119. Searching for files in directory /makepkg/libdigidocpp/src/libdigidocpp-build/CMakeFiles/3.11.4
  120. Searching for files in directory /makepkg/libdigidocpp/src/libdigidocpp-build/CMakeFiles/3.11.4/CompilerIdC
  121. Searching for files in directory /makepkg/libdigidocpp/src/libdigidocpp-build/CMakeFiles/3.11.4/CompilerIdC/tmp
  122. Searching for files in directory /makepkg/libdigidocpp/src/libdigidocpp-build/CMakeFiles/3.11.4/CompilerIdCXX
  123. Searching for files in directory /makepkg/libdigidocpp/src/libdigidocpp-build/CMakeFiles/3.11.4/CompilerIdCXX/tmp
  124. Searching for files in directory /makepkg/libdigidocpp/src/libdigidocpp-build/CMakeFiles/CMakeTmp
  125. Searching for files in directory /makepkg/libdigidocpp/src/libdigidocpp-build/CMakeFiles/docs.dir
  126. Searching for files in directory /makepkg/libdigidocpp/src/libdigidocpp-build/CMakeFiles/Progress
  127. Searching for files in directory /makepkg/libdigidocpp/src/libdigidocpp-build/doc
  128. Searching for files in directory /makepkg/libdigidocpp/src/libdigidocpp-build/examples
  129. Searching for files in directory /makepkg/libdigidocpp/src/libdigidocpp-build/examples/CMakeFiles
  130. Searching for files in directory /makepkg/libdigidocpp/src/libdigidocpp-build/examples/CMakeFiles/pkcs11sign.dir
  131. Searching for files in directory /makepkg/libdigidocpp/src/libdigidocpp-build/src
  132. Searching for files in directory /makepkg/libdigidocpp/src/libdigidocpp-build/src/CMakeFiles
  133. Searching for files in directory /makepkg/libdigidocpp/src/libdigidocpp-build/src/CMakeFiles/digidoc-tool.dir
  134. Searching for files in directory /makepkg/libdigidocpp/src/libdigidocpp-build/src/CMakeFiles/digidocpp.dir
  135. Searching for files in directory /makepkg/libdigidocpp/src/libdigidocpp-build/src/CMakeFiles/digidocpp.dir/crypto
  136. Searching for files in directory /makepkg/libdigidocpp/src/libdigidocpp-build/src/CMakeFiles/digidocpp.dir/util
  137. Searching for files in directory /makepkg/libdigidocpp/src/libdigidocpp-build/src/CMakeFiles/digidocpp_priv.dir
  138. Searching for files in directory /makepkg/libdigidocpp/src/libdigidocpp-build/src/CMakeFiles/digidocpp_priv.dir/crypto
  139. Searching for files in directory /makepkg/libdigidocpp/src/libdigidocpp-build/src/CMakeFiles/digidocpp_priv.dir/util
  140. Searching for files in directory /makepkg/libdigidocpp/src/libdigidocpp-build/src/CMakeFiles/digidocpp_priv.dir/xml
  141. Searching for files in directory /makepkg/libdigidocpp/src/libdigidocpp-build/src/CMakeFiles/minizip.dir
  142. Searching for files in directory /makepkg/libdigidocpp/src/libdigidocpp-build/src/CMakeFiles/minizip.dir/minizip
  143. Searching for files in directory /makepkg/libdigidocpp/src/libdigidocpp-build/src/xml
  144. Searching for files in directory /makepkg/libdigidocpp/src/libdigidocpp-build/test
  145. Searching for files in directory /makepkg/libdigidocpp/src/libdigidocpp-build/test/CMakeFiles
  146. Searching for files in directory /makepkg/libdigidocpp/src/patches
  147. Searching for files in directory /makepkg/libdigidocpp/src/src
  148. Searching for files in directory /makepkg/libdigidocpp/src/src/crypto
  149. Searching for files in directory /makepkg/libdigidocpp/src/src/minizip
  150. Searching for files in directory /makepkg/libdigidocpp/src/src/util
  151. Searching for files in directory /makepkg/libdigidocpp/src/src/xml
  152. Searching for files in directory /makepkg/libdigidocpp/src/test
  153. Searching for files in directory /makepkg/libdigidocpp/src/test/data
  154. Searching for files in directory /makepkg/libdigidocpp/src/libdigidocpp-build
  155. Searching for files in directory /makepkg/libdigidocpp/src/libdigidocpp-build/CMakeFiles
  156. Searching for files in directory /makepkg/libdigidocpp/src/libdigidocpp-build/CMakeFiles/3.11.4
  157. Searching for files in directory /makepkg/libdigidocpp/src/libdigidocpp-build/CMakeFiles/3.11.4/CompilerIdC
  158. Searching for files in directory /makepkg/libdigidocpp/src/libdigidocpp-build/CMakeFiles/3.11.4/CompilerIdC/tmp
  159. Searching for files in directory /makepkg/libdigidocpp/src/libdigidocpp-build/CMakeFiles/3.11.4/CompilerIdCXX
  160. Searching for files in directory /makepkg/libdigidocpp/src/libdigidocpp-build/CMakeFiles/3.11.4/CompilerIdCXX/tmp
  161. Searching for files in directory /makepkg/libdigidocpp/src/libdigidocpp-build/CMakeFiles/CMakeTmp
  162. Searching for files in directory /makepkg/libdigidocpp/src/libdigidocpp-build/CMakeFiles/docs.dir
  163. Searching for files in directory /makepkg/libdigidocpp/src/libdigidocpp-build/CMakeFiles/Progress
  164. Searching for files in directory /makepkg/libdigidocpp/src/libdigidocpp-build/doc
  165. Searching for files in directory /makepkg/libdigidocpp/src/libdigidocpp-build/examples
  166. Searching for files in directory /makepkg/libdigidocpp/src/libdigidocpp-build/examples/CMakeFiles
  167. Searching for files in directory /makepkg/libdigidocpp/src/libdigidocpp-build/examples/CMakeFiles/pkcs11sign.dir
  168. Searching for files in directory /makepkg/libdigidocpp/src/libdigidocpp-build/src
  169. Searching for files in directory /makepkg/libdigidocpp/src/libdigidocpp-build/src/CMakeFiles
  170. Searching for files in directory /makepkg/libdigidocpp/src/libdigidocpp-build/src/CMakeFiles/digidoc-tool.dir
  171. Searching for files in directory /makepkg/libdigidocpp/src/libdigidocpp-build/src/CMakeFiles/digidocpp.dir
  172. Searching for files in directory /makepkg/libdigidocpp/src/libdigidocpp-build/src/CMakeFiles/digidocpp.dir/crypto
  173. Searching for files in directory /makepkg/libdigidocpp/src/libdigidocpp-build/src/CMakeFiles/digidocpp.dir/util
  174. Searching for files in directory /makepkg/libdigidocpp/src/libdigidocpp-build/src/CMakeFiles/digidocpp_priv.dir
  175. Searching for files in directory /makepkg/libdigidocpp/src/libdigidocpp-build/src/CMakeFiles/digidocpp_priv.dir/crypto
  176. Searching for files in directory /makepkg/libdigidocpp/src/libdigidocpp-build/src/CMakeFiles/digidocpp_priv.dir/util
  177. Searching for files in directory /makepkg/libdigidocpp/src/libdigidocpp-build/src/CMakeFiles/digidocpp_priv.dir/xml
  178. Searching for files in directory /makepkg/libdigidocpp/src/libdigidocpp-build/src/CMakeFiles/minizip.dir
  179. Searching for files in directory /makepkg/libdigidocpp/src/libdigidocpp-build/src/CMakeFiles/minizip.dir/minizip
  180. Searching for files in directory /makepkg/libdigidocpp/src/libdigidocpp-build/src/xml
  181. Searching for files in directory /makepkg/libdigidocpp/src/libdigidocpp-build/test
  182. Searching for files in directory /makepkg/libdigidocpp/src/libdigidocpp-build/test/CMakeFiles
  183. Searching for images...
  184. Searching for files in directory /makepkg/libdigidocpp/src/doc/images
  185. Searching for dot files...
  186. Searching for msc files...
  187. Searching for dia files...
  188. Searching for files to exclude
  189. Searching INPUT for files to process...
  190. Searching for files in directory /makepkg/libdigidocpp/src/src
  191. Searching for files in directory /makepkg/libdigidocpp/src/src/crypto
  192. Searching for files in directory /makepkg/libdigidocpp/src/src/minizip
  193. Searching for files in directory /makepkg/libdigidocpp/src/src/util
  194. Searching for files in directory /makepkg/libdigidocpp/src/src/xml
  195. Reading and parsing tag files
  196. Parsing files
  197. Preprocessing /makepkg/libdigidocpp/src/src/Conf.cpp...
  198. Parsing file /makepkg/libdigidocpp/src/src/Conf.cpp...
  199. Preprocessing /makepkg/libdigidocpp/src/src/Conf.h...
  200. Parsing file /makepkg/libdigidocpp/src/src/Conf.h...
  201. Preprocessing /makepkg/libdigidocpp/src/src/Container.cpp...
  202. Parsing file /makepkg/libdigidocpp/src/src/Container.cpp...
  203. Preprocessing /makepkg/libdigidocpp/src/src/Container.h...
  204. Parsing file /makepkg/libdigidocpp/src/src/Container.h...
  205. [ 8%] Generating xml/XAdES01903v132-201601.cxx, xml/XAdES01903v132-201601.hxx
  206. Preprocessing /makepkg/libdigidocpp/src/src/crypto/PKCS11Signer.cpp...
  207. Parsing file /makepkg/libdigidocpp/src/src/crypto/PKCS11Signer.cpp...
  208. Preprocessing /makepkg/libdigidocpp/src/src/crypto/PKCS11Signer.h...
  209. Parsing file /makepkg/libdigidocpp/src/src/crypto/PKCS11Signer.h...
  210. Preprocessing /makepkg/libdigidocpp/src/src/crypto/PKCS12Signer.cpp...
  211. Parsing file /makepkg/libdigidocpp/src/src/crypto/PKCS12Signer.cpp...
  212. Preprocessing /makepkg/libdigidocpp/src/src/crypto/PKCS12Signer.h...
  213. Parsing file /makepkg/libdigidocpp/src/src/crypto/PKCS12Signer.h...
  214. Preprocessing /makepkg/libdigidocpp/src/src/crypto/Signer.cpp...
  215. Parsing file /makepkg/libdigidocpp/src/src/crypto/Signer.cpp...
  216. Preprocessing /makepkg/libdigidocpp/src/src/crypto/Signer.h...
  217. Parsing file /makepkg/libdigidocpp/src/src/crypto/Signer.h...
  218. [ 9%] Building C object src/CMakeFiles/minizip.dir/minizip/unzip.c.o
  219. Preprocessing /makepkg/libdigidocpp/src/src/crypto/WinSigner.cpp...
  220. Parsing file /makepkg/libdigidocpp/src/src/crypto/WinSigner.cpp...
  221. Preprocessing /makepkg/libdigidocpp/src/src/crypto/WinSigner.h...
  222. Parsing file /makepkg/libdigidocpp/src/src/crypto/WinSigner.h...
  223. Preprocessing /makepkg/libdigidocpp/src/src/crypto/X509Cert.cpp...
  224. Parsing file /makepkg/libdigidocpp/src/src/crypto/X509Cert.cpp...
  225. Preprocessing /makepkg/libdigidocpp/src/src/crypto/X509Cert.h...
  226. Parsing file /makepkg/libdigidocpp/src/src/crypto/X509Cert.h...
  227. Preprocessing /makepkg/libdigidocpp/src/src/DataFile.cpp...
  228. Parsing file /makepkg/libdigidocpp/src/src/DataFile.cpp...
  229. Preprocessing /makepkg/libdigidocpp/src/src/DataFile.h...
  230. Parsing file /makepkg/libdigidocpp/src/src/DataFile.h...
  231. Preprocessing /makepkg/libdigidocpp/src/src/embedfile.cpp...
  232. Parsing file /makepkg/libdigidocpp/src/src/embedfile.cpp...
  233. Preprocessing /makepkg/libdigidocpp/src/src/Exception.cpp...
  234. Parsing file /makepkg/libdigidocpp/src/src/Exception.cpp...
  235. Preprocessing /makepkg/libdigidocpp/src/src/Exception.h...
  236. Parsing file /makepkg/libdigidocpp/src/src/Exception.h...
  237. Preprocessing /makepkg/libdigidocpp/src/src/Exports.h...
  238. Parsing file /makepkg/libdigidocpp/src/src/Exports.h...
  239. Preprocessing /makepkg/libdigidocpp/src/src/Signature.cpp...
  240. Parsing file /makepkg/libdigidocpp/src/src/Signature.cpp...
  241. Preprocessing /makepkg/libdigidocpp/src/src/Signature.h...
  242. Parsing file /makepkg/libdigidocpp/src/src/Signature.h...
  243. Preprocessing /makepkg/libdigidocpp/src/src/XmlConf.cpp...
  244. Parsing file /makepkg/libdigidocpp/src/src/XmlConf.cpp...
  245. Preprocessing /makepkg/libdigidocpp/src/src/XmlConf.h...
  246. Parsing file /makepkg/libdigidocpp/src/src/XmlConf.h...
  247. Preprocessing /makepkg/libdigidocpp/src/libdigidocpp.dox...
  248. Parsing file /makepkg/libdigidocpp/src/libdigidocpp.dox...
  249. Building group list...
  250. Building directory list...
  251. Building namespace list...
  252. Building file list...
  253. Building class list...
  254. Associating documentation with classes...
  255. Computing nesting relations for classes...
  256. Building example list...
  257. Searching for enumerations...
  258. Searching for documented typedefs...
  259. Searching for members imported via using declarations...
  260. Searching for included using directives...
  261. Searching for documented variables...
  262. Building interface member list...
  263. Building member list...
  264. [ 10%] Building C object src/CMakeFiles/minizip.dir/minizip/ioapi.c.o
  265. Searching for friends...
  266. Searching for documented defines...
  267. Computing class inheritance relations...
  268. Computing class usage relations...
  269. Flushing cached template relations that have become invalid...
  270. Computing class relations...
  271. Add enum values to enums...
  272. Searching for member function documentation...
  273. /makepkg/libdigidocpp/src/src/crypto/X509Cert.cpp:289: warning: documented symbol `X509Cert::operator vector< unsigned char >' was not declared or defined.
  274. /makepkg/libdigidocpp/src/src/DataFile.cpp:89: warning: documented symbol `DataFilePrivate::DataFilePrivate' was not declared or defined.
  275. /makepkg/libdigidocpp/src/src/DataFile.cpp:102: warning: no matching class member found for
  276. vector< unsigned char > DataFilePrivate::calcDigest(const string &method) const
  277.  
  278. /makepkg/libdigidocpp/src/src/DataFile.cpp:111: warning: no matching class member found for
  279. void DataFilePrivate::calcDigest(Digest *digest) const
  280.  
  281. /makepkg/libdigidocpp/src/src/DataFile.cpp:124: warning: no uniquely matching class member found for
  282. void DataFilePrivate::saveAs(const string &path) const
  283.  
  284. /makepkg/libdigidocpp/src/src/DataFile.cpp:131: warning: no uniquely matching class member found for
  285. void DataFilePrivate::saveAs(ostream &os) const
  286.  
  287. Creating members for template instances...
  288. Building page list...
  289. Search for main page...
  290. Computing page relations...
  291. Determining the scope of groups...
  292. Sorting lists...
  293. Freeing entry tree
  294. Determining which enums are documented
  295. Computing member relations...
  296. Building full member lists recursively...
  297. Adding members to member groups.
  298. Computing member references...
  299. Inheriting documentation...
  300. Generating disk names...
  301. Adding source references...
  302. Adding xrefitems...
  303. Sorting member lists...
  304. Computing dependencies between directories...
  305. Generating citations page...
  306. Counting data structures...
  307. Resolving user defined references...
  308. Finding anchors and sections in the documentation...
  309. Transferring function references...
  310. Combining using relations...
  311. Adding members to index pages...
  312. Generating style sheet...
  313. Generating search indices...
  314. Generating example documentation...
  315. Generating file sources...
  316. Parsing code for file Conf.cpp...
  317. Parsing code for file Conf.h...
  318. Parsing code for file Container.cpp...
  319. Parsing code for file Container.h...
  320. Parsing code for file DataFile.cpp...
  321. Parsing code for file DataFile.h...
  322. Parsing code for file embedfile.cpp...
  323. Parsing code for file Exception.cpp...
  324. Parsing code for file Exception.h...
  325. Parsing code for file Exports.h...
  326. Parsing code for file libdigidocpp.dox...
  327. Parsing code for file PKCS11Signer.cpp...
  328. Parsing code for file PKCS11Signer.h...
  329. Parsing code for file PKCS12Signer.cpp...
  330. Parsing code for file PKCS12Signer.h...
  331. Parsing code for file Signature.cpp...
  332. Parsing code for file Signature.h...
  333. Parsing code for file Signer.cpp...
  334. Parsing code for file Signer.h...
  335. Parsing code for file WinSigner.cpp...
  336. Parsing code for file WinSigner.h...
  337. Parsing code for file X509Cert.cpp...
  338. Parsing code for file X509Cert.h...
  339. Parsing code for file XmlConf.cpp...
  340. Parsing code for file XmlConf.h...
  341. Generating file documentation...
  342. Generating page documentation...
  343. Generating docs for page manual...
  344. [ 11%] Generating xml/XAdES01903v141-201601.cxx, xml/XAdES01903v141-201601.hxx
  345. [ 14%] Generating xml/OpenDocument_dsig.cxx, xml/OpenDocument_dsig.hxx
  346. [ 14%] Generating xml/en_31916201v010101.cxx, xml/en_31916201v010101.hxx
  347. Generating docs for page deprecated...
  348. Generating group documentation...
  349. Generating class documentation...
  350. Generating namespace index...
  351. Generating docs for namespace digidoc
  352. Generating docs for compound digidoc::Conf...
  353. Generating docs for compound digidoc::ConfV2...
  354. Generating docs for compound digidoc::Container...
  355. Generating docs for compound digidoc::DataFile...
  356. Generating docs for compound digidoc::Exception...
  357. Generating docs for compound digidoc::PKCS11Signer...
  358. Generating docs for compound digidoc::PKCS12Signer...
  359. Generating docs for compound digidoc::Signature...
  360. Generating docs for compound digidoc::Signer...
  361. Generating docs for compound digidoc::WinSigner...
  362. Generating docs for compound digidoc::X509Cert...
  363. Generating docs for compound digidoc::XmlConf...
  364. Generating docs for compound digidoc::XmlConfV2...
  365. Generating graph info page...
  366. Generating directory documentation...
  367. Generating index page...
  368. Generating page index...
  369. Generating module index...
  370. Generating namespace member index...
  371. Generating annotated compound index...
  372. Generating alphabetical compound index...
  373. Generating hierarchical class index...
  374. Generating member index...
  375. [ 15%] Generating xml/xml.cxx, xml/xml.hxx
  376. Generating file member index...
  377. Generating example index...
  378. finalizing index lists...
  379. writing tag file...
  380. lookup cache used 1442/65536 hits=9341 misses=1554
  381. finished...
  382. [ 16%] Generating xml/ts_119612v020201_201601xsd.cxx, xml/ts_119612v020201_201601xsd.hxx
  383. [ 17%] Generating xml/ts_119612v020101_additionaltypes_xsd.cxx, xml/ts_119612v020101_additionaltypes_xsd.hxx
  384. [ 17%] Built target docs
  385. Scanning dependencies of target digidocpp_priv
  386. [ 20%] Building CXX object src/CMakeFiles/digidocpp_priv.dir/xml/xmldsig-core-schema.cxx.o
  387. [ 20%] Building CXX object src/CMakeFiles/digidocpp_priv.dir/xml/conf.cxx.o
  388. [ 21%] Building CXX object src/CMakeFiles/digidocpp_priv.dir/xml/OpenDocument_manifest.cxx.o
  389. [ 23%] Building CXX object src/CMakeFiles/digidocpp_priv.dir/xml/XAdES01903v141-201601.cxx.o
  390. [ 23%] Building CXX object src/CMakeFiles/digidocpp_priv.dir/xml/XAdES01903v132-201601.cxx.o
  391. [ 24%] Linking C static library libminizip.a
  392. [ 24%] Built target minizip
  393. [ 25%] Building CXX object src/CMakeFiles/digidocpp_priv.dir/xml/en_31916201v010101.cxx.o
  394. [ 27%] Building CXX object src/CMakeFiles/digidocpp_priv.dir/xml/OpenDocument_dsig.cxx.o
  395. [ 28%] Building CXX object src/CMakeFiles/digidocpp_priv.dir/xml/xml.cxx.o
  396. [ 29%] Building CXX object src/CMakeFiles/digidocpp_priv.dir/xml/ts_119612v020201_201601xsd.cxx.o
  397. [ 30%] Building CXX object src/CMakeFiles/digidocpp_priv.dir/xml/ts_119612v020101_additionaltypes_xsd.cxx.o
  398. [ 31%] Building CXX object src/CMakeFiles/digidocpp_priv.dir/xml/ts_119612v020101_sie_xsd.cxx.o
  399. [ 32%] Building CXX object src/CMakeFiles/digidocpp_priv.dir/log.cpp.o
  400. [ 34%] Building CXX object src/CMakeFiles/digidocpp_priv.dir/crypto/Connect.cpp.o
  401. [ 35%] Building CXX object src/CMakeFiles/digidocpp_priv.dir/crypto/Digest.cpp.o
  402. [ 36%] Building CXX object src/CMakeFiles/digidocpp_priv.dir/crypto/TSL.cpp.o
  403. [ 37%] Building CXX object src/CMakeFiles/digidocpp_priv.dir/crypto/X509Crypto.cpp.o
  404. [ 38%] Building CXX object src/CMakeFiles/digidocpp_priv.dir/util/File.cpp.o
  405. [ 40%] Building CXX object src/CMakeFiles/digidocpp_priv.dir/util/DateTime.cpp.o
  406. [ 41%] Building CXX object src/CMakeFiles/digidocpp_priv.dir/xml/AdditionalInformationType.cpp.o
  407. [ 42%] Building CXX object src/CMakeFiles/digidocpp_priv.dir/xml/AnyType.cpp.o
  408. [ 43%] Building CXX object src/CMakeFiles/digidocpp_priv.dir/xml/ExtensionType.cpp.o
  409. [ 44%] Building CXX object src/CMakeFiles/digidocpp_priv.dir/xml/ObjectType.cpp.o
  410. [ 45%] Building CXX object src/CMakeFiles/digidocpp_priv.dir/xml/SecureDOMParser.cpp.o
  411. [ 47%] Building CXX object src/CMakeFiles/digidocpp_priv.dir/xml/UnsignedSignaturePropertiesType.cpp.o
  412. [ 48%] Building CXX object src/CMakeFiles/digidocpp_priv.dir/xml/URIResolver.cpp.o
  413. [ 49%] Linking CXX static library libdigidocpp_priv.a
  414. [ 49%] Built target digidocpp_priv
  415. [ 52%] Generating tslcert2.h from /makepkg/libdigidocpp/src/etc/tl-mp2.crt
  416. [ 52%] Generating tslcert3.h from /makepkg/libdigidocpp/src/etc/tl-mp3.crt
  417. [ 52%] Generating tslcert4.h from /makepkg/libdigidocpp/src/etc/tl-mp4.crt
  418. [ 54%] Generating tslcert1.h from /makepkg/libdigidocpp/src/etc/tl-mp1.crt
  419. [ 55%] Generating tslcert5.h from /makepkg/libdigidocpp/src/etc/tl-mp5.crt
  420. Scanning dependencies of target digidocpp
  421. [ 57%] Building CXX object src/CMakeFiles/digidocpp.dir/Container.cpp.o
  422. [ 57%] Building CXX object src/CMakeFiles/digidocpp.dir/SignatureCAdES_T.cpp.o
  423. [ 60%] Building CXX object src/CMakeFiles/digidocpp.dir/SignatureCAdES_B.cpp.o
  424. [ 60%] Building CXX object src/CMakeFiles/digidocpp.dir/PDF.cpp.o
  425. [ 61%] Building CXX object src/CMakeFiles/digidocpp.dir/ASiContainer.cpp.o
  426. [ 62%] Building CXX object src/CMakeFiles/digidocpp.dir/ASiC_E.cpp.o
  427. In file included from /makepkg/libdigidocpp/src/src/SignatureCAdES_B.cpp:21:
  428. /makepkg/libdigidocpp/src/src/SignatureCAdES_p.h:33:13: error: field ‘method’ has incomplete type ‘RSA_METHOD’ {aka ‘rsa_meth_st’}
  429. RSA_METHOD method;
  430. ^~~~~~
  431. In file included from /usr/include/openssl/x509.h:20,
  432. from /usr/include/openssl/cms.h:16,
  433. from /makepkg/libdigidocpp/src/src/SignatureCAdES_p.h:22,
  434. from /makepkg/libdigidocpp/src/src/SignatureCAdES_B.cpp:21:
  435. /usr/include/openssl/ossl_typ.h:111:16: note: forward declaration of ‘RSA_METHOD’ {aka ‘struct rsa_meth_st’}
  436. typedef struct rsa_meth_st RSA_METHOD;
  437. ^~~~~~~~~~~
  438. In file included from /makepkg/libdigidocpp/src/src/SignatureCAdES_T.cpp:21:
  439. /makepkg/libdigidocpp/src/src/SignatureCAdES_p.h:33:13: error: field ‘method’ has incomplete type ‘RSA_METHOD’ {aka ‘rsa_meth_st’}
  440. RSA_METHOD method;
  441. ^~~~~~
  442. In file included from /usr/include/openssl/x509.h:20,
  443. from /usr/include/openssl/cms.h:16,
  444. from /makepkg/libdigidocpp/src/src/SignatureCAdES_p.h:22,
  445. from /makepkg/libdigidocpp/src/src/SignatureCAdES_T.cpp:21:
  446. /usr/include/openssl/ossl_typ.h:111:16: note: forward declaration of ‘RSA_METHOD’ {aka ‘struct rsa_meth_st’}
  447. typedef struct rsa_meth_st RSA_METHOD;
  448. ^~~~~~~~~~~
  449. [ 63%] Building CXX object src/CMakeFiles/digidocpp.dir/ASiC_S.cpp.o
  450. /makepkg/libdigidocpp/src/src/SignatureCAdES_B.cpp: In constructor ‘digidoc::SignatureCAdES_B::SignatureCAdES_B(digidoc::Signer*)’:
  451. /makepkg/libdigidocpp/src/src/SignatureCAdES_B.cpp:68:8: error: invalid use of incomplete type ‘RSA’ {aka ‘struct rsa_st’}
  452. rsa->flags |= RSA_FLAG_SIGN_VER;
  453. ^~
  454. In file included from /usr/include/openssl/x509.h:20,
  455. from /usr/include/openssl/cms.h:16,
  456. from /makepkg/libdigidocpp/src/src/SignatureCAdES_p.h:22,
  457. from /makepkg/libdigidocpp/src/src/SignatureCAdES_B.cpp:21:
  458. /usr/include/openssl/ossl_typ.h:110:16: note: forward declaration of ‘RSA’ {aka ‘struct rsa_st’}
  459. typedef struct rsa_st RSA;
  460. ^~~~~~
  461. /makepkg/libdigidocpp/src/src/SignatureCAdES_B.cpp:68:19: error: ‘RSA_FLAG_SIGN_VER’ was not declared in this scope
  462. rsa->flags |= RSA_FLAG_SIGN_VER;
  463. ^~~~~~~~~~~~~~~~~
  464. /makepkg/libdigidocpp/src/src/SignatureCAdES_B.cpp:68:19: note: suggested alternative: ‘RSA_FLAG_EXT_PKEY’
  465. rsa->flags |= RSA_FLAG_SIGN_VER;
  466. ^~~~~~~~~~~~~~~~~
  467. RSA_FLAG_EXT_PKEY
  468. /makepkg/libdigidocpp/src/src/SignatureCAdES_B.cpp:74:30: error: invalid use of incomplete type ‘ESS_CERT_ID’ {aka ‘struct ESS_cert_id’}
  469. ASN1_OCTET_STRING_set(cid->hash, cert->sha1_hash, sizeof(cert->sha1_hash));
  470. ^~
  471. In file included from /makepkg/libdigidocpp/src/src/SignatureCAdES_B.cpp:31:
  472. /usr/include/openssl/ts.h:59:16: note: forward declaration of ‘ESS_CERT_ID’ {aka ‘struct ESS_cert_id’}
  473. typedef struct ESS_cert_id ESS_CERT_ID;
  474. ^~~~~~~~~~~
  475. /makepkg/libdigidocpp/src/src/SignatureCAdES_B.cpp:74:42: error: invalid use of incomplete type ‘X509’ {aka ‘struct x509_st’}
  476. ASN1_OCTET_STRING_set(cid->hash, cert->sha1_hash, sizeof(cert->sha1_hash));
  477. ^~
  478. In file included from /usr/include/openssl/x509.h:20,
  479. from /usr/include/openssl/cms.h:16,
  480. from /makepkg/libdigidocpp/src/src/SignatureCAdES_p.h:22,
  481. from /makepkg/libdigidocpp/src/src/SignatureCAdES_B.cpp:21:
  482. /usr/include/openssl/ossl_typ.h:119:16: note: forward declaration of ‘X509’ {aka ‘struct x509_st’}
  483. typedef struct x509_st X509;
  484. ^~~~~~~
  485. /makepkg/libdigidocpp/src/src/SignatureCAdES_B.cpp:74:66: error: invalid use of incomplete type ‘X509’ {aka ‘struct x509_st’}
  486. ASN1_OCTET_STRING_set(cid->hash, cert->sha1_hash, sizeof(cert->sha1_hash));
  487. ^~
  488. In file included from /usr/include/openssl/x509.h:20,
  489. from /usr/include/openssl/cms.h:16,
  490. from /makepkg/libdigidocpp/src/src/SignatureCAdES_p.h:22,
  491. from /makepkg/libdigidocpp/src/src/SignatureCAdES_B.cpp:21:
  492. /usr/include/openssl/ossl_typ.h:119:16: note: forward declaration of ‘X509’ {aka ‘struct x509_st’}
  493. typedef struct x509_st X509;
  494. ^~~~~~~
  495. /makepkg/libdigidocpp/src/src/SignatureCAdES_B.cpp:78:38: error: invalid use of incomplete type ‘X509’ {aka ‘struct x509_st’}
  496. name->d.dirn = X509_NAME_dup(cert->cert_info->issuer);
  497. ^~
  498. In file included from /usr/include/openssl/x509.h:20,
  499. from /usr/include/openssl/cms.h:16,
  500. from /makepkg/libdigidocpp/src/src/SignatureCAdES_p.h:22,
  501. from /makepkg/libdigidocpp/src/src/SignatureCAdES_B.cpp:21:
  502. /usr/include/openssl/ossl_typ.h:119:16: note: forward declaration of ‘X509’ {aka ‘struct x509_st’}
  503. typedef struct x509_st X509;
  504. ^~~~~~~
  505. /makepkg/libdigidocpp/src/src/SignatureCAdES_B.cpp:80:8: error: invalid use of incomplete type ‘ESS_CERT_ID’ {aka ‘struct ESS_cert_id’}
  506. cid->issuer_serial = ESS_ISSUER_SERIAL_new();
  507. ^~
  508. In file included from /makepkg/libdigidocpp/src/src/SignatureCAdES_B.cpp:31:
  509. /usr/include/openssl/ts.h:59:16: note: forward declaration of ‘ESS_CERT_ID’ {aka ‘struct ESS_cert_id’}
  510. typedef struct ESS_cert_id ESS_CERT_ID;
  511. ^~~~~~~~~~~
  512. /makepkg/libdigidocpp/src/src/SignatureCAdES_B.cpp:81:29: error: invalid use of incomplete type ‘ESS_CERT_ID’ {aka ‘struct ESS_cert_id’}
  513. sk_GENERAL_NAME_push(cid->issuer_serial->issuer, name);
  514. ^~
  515. In file included from /makepkg/libdigidocpp/src/src/SignatureCAdES_B.cpp:31:
  516. /usr/include/openssl/ts.h:59:16: note: forward declaration of ‘ESS_CERT_ID’ {aka ‘struct ESS_cert_id’}
  517. typedef struct ESS_cert_id ESS_CERT_ID;
  518. ^~~~~~~~~~~
  519. /makepkg/libdigidocpp/src/src/SignatureCAdES_B.cpp:82:26: error: invalid use of incomplete type ‘ESS_CERT_ID’ {aka ‘struct ESS_cert_id’}
  520. ASN1_INTEGER_free(cid->issuer_serial->serial);
  521. ^~
  522. In file included from /makepkg/libdigidocpp/src/src/SignatureCAdES_B.cpp:31:
  523. /usr/include/openssl/ts.h:59:16: note: forward declaration of ‘ESS_CERT_ID’ {aka ‘struct ESS_cert_id’}
  524. typedef struct ESS_cert_id ESS_CERT_ID;
  525. ^~~~~~~~~~~
  526. /makepkg/libdigidocpp/src/src/SignatureCAdES_B.cpp:83:8: error: invalid use of incomplete type ‘ESS_CERT_ID’ {aka ‘struct ESS_cert_id’}
  527. cid->issuer_serial->serial = ASN1_INTEGER_dup(cert->cert_info->serialNumber);
  528. ^~
  529. In file included from /makepkg/libdigidocpp/src/src/SignatureCAdES_B.cpp:31:
  530. /usr/include/openssl/ts.h:59:16: note: forward declaration of ‘ESS_CERT_ID’ {aka ‘struct ESS_cert_id’}
  531. typedef struct ESS_cert_id ESS_CERT_ID;
  532. ^~~~~~~~~~~
  533. /makepkg/libdigidocpp/src/src/SignatureCAdES_B.cpp:83:55: error: invalid use of incomplete type ‘X509’ {aka ‘struct x509_st’}
  534. cid->issuer_serial->serial = ASN1_INTEGER_dup(cert->cert_info->serialNumber);
  535. ^~
  536. In file included from /usr/include/openssl/x509.h:20,
  537. from /usr/include/openssl/cms.h:16,
  538. from /makepkg/libdigidocpp/src/src/SignatureCAdES_p.h:22,
  539. from /makepkg/libdigidocpp/src/src/SignatureCAdES_B.cpp:21:
  540. /usr/include/openssl/ossl_typ.h:119:16: note: forward declaration of ‘X509’ {aka ‘struct x509_st’}
  541. typedef struct x509_st X509;
  542. ^~~~~~~
  543. /makepkg/libdigidocpp/src/src/SignatureCAdES_B.cpp:86:8: error: invalid use of incomplete type ‘ESS_SIGNING_CERT’ {aka ‘struct ESS_signing_cert’}
  544. ess->cert_ids = sk_ESS_CERT_ID_new_null();
  545. ^~
  546. In file included from /makepkg/libdigidocpp/src/src/SignatureCAdES_B.cpp:31:
  547. /usr/include/openssl/ts.h:60:16: note: forward declaration of ‘ESS_SIGNING_CERT’ {aka ‘struct ESS_signing_cert’}
  548. typedef struct ESS_signing_cert ESS_SIGNING_CERT;
  549. ^~~~~~~~~~~~~~~~
  550. /makepkg/libdigidocpp/src/src/SignatureCAdES_B.cpp:87:28: error: invalid use of incomplete type ‘ESS_SIGNING_CERT’ {aka ‘struct ESS_signing_cert’}
  551. sk_ESS_CERT_ID_push(ess->cert_ids, cid);
  552. ^~
  553. In file included from /makepkg/libdigidocpp/src/src/SignatureCAdES_B.cpp:31:
  554. /usr/include/openssl/ts.h:60:16: note: forward declaration of ‘ESS_SIGNING_CERT’ {aka ‘struct ESS_signing_cert’}
  555. typedef struct ESS_signing_cert ESS_SIGNING_CERT;
  556. ^~~~~~~~~~~~~~~~
  557. make[2]: *** [src/CMakeFiles/digidocpp.dir/build.make:186: src/CMakeFiles/digidocpp.dir/SignatureCAdES_T.cpp.o] Error 1
  558. make[2]: *** Waiting for unfinished jobs....
  559. make[2]: *** [src/CMakeFiles/digidocpp.dir/build.make:173: src/CMakeFiles/digidocpp.dir/SignatureCAdES_B.cpp.o] Error 1
  560. /makepkg/libdigidocpp/src/src/PDF.cpp:49:1: error: expected class-name before ‘{’ token
  561. {
  562. ^
  563. /makepkg/libdigidocpp/src/src/PDF.cpp: In constructor ‘digidoc::DSSPdfSigIncMemDocument::DSSPdfSigIncMemDocument(const char*)’:
  564. /makepkg/libdigidocpp/src/src/PDF.cpp:51:58: error: class ‘digidoc::DSSPdfSigIncMemDocument’ does not have any field named ‘PdfSigIncMemDocument’
  565. DSSPdfSigIncMemDocument(const char* pszInpFilename): PdfSigIncMemDocument(pszInpFilename) {}
  566. ^~~~~~~~~~~~~~~~~~~~
  567. /makepkg/libdigidocpp/src/src/PDF.cpp: In member function ‘PoDoFo::PdfAcroForm* digidoc::DSSPdfSigIncMemDocument::GetAcroForm()’:
  568. /makepkg/libdigidocpp/src/src/PDF.cpp:52:41: error: ‘GetExistedAcroForm’ was not declared in this scope
  569. PdfAcroForm* GetAcroForm() { return GetExistedAcroForm(nullptr); }
  570. ^~~~~~~~~~~~~~~~~~
  571. /makepkg/libdigidocpp/src/src/PDF.cpp:52:41: note: suggested alternative: ‘GetAcroForm’
  572. PdfAcroForm* GetAcroForm() { return GetExistedAcroForm(nullptr); }
  573. ^~~~~~~~~~~~~~~~~~
  574. GetAcroForm
  575. /makepkg/libdigidocpp/src/src/PDF.cpp: In member function ‘virtual digidoc::Signature* digidoc::PDF::sign(digidoc::Signer*)’:
  576. /makepkg/libdigidocpp/src/src/PDF.cpp:329:13: error: ‘class digidoc::DSSPdfSigIncMemDocument’ has no member named ‘GetSignatureField’
  577. doc.GetSignatureField()->SetSignatureDate(PdfDate());
  578. ^~~~~~~~~~~~~~~~~
  579. /makepkg/libdigidocpp/src/src/PDF.cpp:330:13: error: ‘class digidoc::DSSPdfSigIncMemDocument’ has no member named ‘GetSignatureField’
  580. doc.GetSignatureField()->SetSignatureReason(roles);
  581. ^~~~~~~~~~~~~~~~~
  582. /makepkg/libdigidocpp/src/src/PDF.cpp:331:13: error: ‘class digidoc::DSSPdfSigIncMemDocument’ has no member named ‘Initialize’
  583. doc.Initialize();
  584. ^~~~~~~~~~
  585. /makepkg/libdigidocpp/src/src/PDF.cpp:359:13: error: ‘class digidoc::DSSPdfSigIncMemDocument’ has no member named ‘Write’
  586. doc.Write(&out);
  587. ^~~~~
  588. make[2]: *** [src/CMakeFiles/digidocpp.dir/build.make:160: src/CMakeFiles/digidocpp.dir/PDF.cpp.o] Error 1
  589. make[1]: *** [CMakeFiles/Makefile2:167: src/CMakeFiles/digidocpp.dir/all] Error 2
  590. make: *** [Makefile:141: all] Error 2
  591. ==> ERROR: A failure occurred in build().
  592. Aborting...
  593. :: Unable to build libdigidocpp - makepkg exited with code: 4
  594.  
Not running #stdin #stdout 0s 0KB
stdin
Standard input is empty
stdout
Standard output is empty